Reaction Details
TargetDual specificity protein kinase CLK1
LigandBDBM50259354
Substrate/Competitorn/a
Meas. Tech.ChEBML_1691310
IC50 130±n/a nM
Citation Bendjeddou, LZLoaëc, NVilliers, BPrina, ESpäth, GFGalons, HMeijer, LOumata, N Exploration of the imidazo[1,2-b]pyridazine scaffold as a protein kinase inhibitor. Eur J Med Chem125:696-709 (2017) 
 
Dual specificity protein kinase CLK1
Name:Dual specificity protein kinase CLK1
Type:PROTEIN
Mol. Mass.:57124.52
Organism:Mus musculus
Description:ChEMBL_1502245
Residue:483
BDBM50259354
NameBDBM50259354
Synonyms:CHEMBL4090223
TypeSmall organic molecule
Emp. Form.C15H12N4S
Mol. Mass.280.348
SMILESCSc1ccc2ncc(-c3ccc4[nH]ccc4c3)n2n1