Reaction Details
TargetDual specificity protein kinase CLK3
LigandBDBM50259335
Substrate/Competitorn/a
Meas. Tech.ChEBML_1691312
IC50 310±n/a nM
Citation Bendjeddou, LZLoaëc, NVilliers, BPrina, ESpäth, GFGalons, HMeijer, LOumata, N Exploration of the imidazo[1,2-b]pyridazine scaffold as a protein kinase inhibitor. Eur J Med Chem125:696-709 (2017) 
 
Dual specificity protein kinase CLK3
Name:Dual specificity protein kinase CLK3
Type:PROTEIN
Mol. Mass.:73855.32
Organism:Mus musculus
Description:ChEMBL_1502247
Residue:638
BDBM50259335
NameBDBM50259335
Synonyms:CHEMBL4072506
TypeSmall organic molecule
Emp. Form.C14H12N4O2
Mol. Mass.268.2707
SMILESCOc1ccc2ncc(-c3cccc(\C=N\O)c3)n2n1