Reaction Details
TargetAmine oxidase [flavin-containing] A
LigandBDBM50105417
Substrate/Competitorn/a
Meas. Tech.ChEMBL_1691469 (CHEMBL4042118)
Ki 163±n/a nM
Citation Chaurasiya, NDGogineni, VElokely, KMLeón, FNúñez, MJKlein, MLWalker, LACutler, SJTekwani, BL Isolation of Acacetin from Calea urticifolia with Inhibitory Properties against Human Monoamine Oxidase-A and -B. J Nat Prod79:2538-2544 (2016) 
 
Amine oxidase [flavin-containing] A
Name:Amine oxidase [flavin-containing] A
Type:Protein
Mol. Mass.:59689.53
Organism:Homo sapiens (Human)
Description:P21397
Residue:527
BDBM50105417
NameBDBM50105417
Synonyms:CHEMBL1089 PHENELZINE | Phenethyl-hydrazine
TypeSmall organic molecule
Emp. Form.C8H12N2
Mol. Mass.136.1943
SMILESNNCCc1ccccc1