Reaction Details
TargetAmine oxidase [flavin-containing] B
LigandBDBM50105417
Substrate/Competitorn/a
Meas. Tech.ChEMBL_1691471 (CHEMBL4042120)
Ki 124±n/a nM
Citation Chaurasiya, NDGogineni, VElokely, KMLeón, FNúñez, MJKlein, MLWalker, LACutler, SJTekwani, BL Isolation of Acacetin from Calea urticifolia with Inhibitory Properties against Human Monoamine Oxidase-A and -B. J Nat Prod79:2538-2544 (2016) 
 
Amine oxidase [flavin-containing] B
Name:Amine oxidase [flavin-containing] B
Type:Protein
Mol. Mass.:58768.76
Organism:Homo sapiens (Human)
Description:P27338
Residue:520
BDBM50105417
NameBDBM50105417
Synonyms:CHEMBL1089 PHENELZINE | Phenethyl-hydrazine
TypeSmall organic molecule
Emp. Form.C8H12N2
Mol. Mass.136.1943
SMILESNNCCc1ccccc1