Reaction Details
TargetLysine-specific histone demethylase 1A
LigandBDBM50236898
Substrate/Competitorn/a
Meas. Tech.ChEMBL_1691602 (CHEMBL4042251)
IC50 27800±n/a nM
Citation Wang, SZhao, LJZheng, YCShen, DDMiao, EFQiao, XPZhao, LJLiu, YHuang, RYu, BLiu, HM Design, synthesis and biological evaluation of [1,2,4]triazolo[1,5-a]pyrimidines as potent lysine specific demethylase 1 (LSD1/KDM1A) inhibitors. Eur J Med Chem125:940-951 (2017) 
 
Lysine-specific histone demethylase 1A
Name:Lysine-specific histone demethylase 1A
Type:Enzyme
Mol. Mass.:92901.01
Organism:Homo sapiens (Human)
Description:O60341
Residue:852
BDBM50236898
NameBDBM50236898
Synonyms:(1S,2R)-(+)-2-phenylcyclopropylamine TRANYLCYPROMINE trans-2-phenylcyclopropanamine | trans-2-phenylcyclopropylamine
TypeSmall organic molecule
Emp. Form.C9H11N
Mol. Mass.133.1903
SMILESN[C@H]1C[C@@H]1c1ccccc1