Reaction Details
TargetNeuronal acetylcholine receptor subunit alpha-3/beta-4
LigandBDBM50194315
Substrate/Competitorn/a
Meas. Tech.ChEMBL_1691727 (CHEMBL4042376)
Ki 1200±n/a nM
Citation Bolchi, CBavo, FGotti, CFumagalli, LFasoli, FBinda, MMucchietto, VSciaccaluga, MPlutino, SFucile, SPallavicini, M From pyrrolidinyl-benzodioxane to pyrrolidinyl-pyridodioxanes, or from unselective antagonism to selective partial agonism at?4?2 nicotinic acetylcholine receptor. Eur J Med Chem125:1132-1144 (2017) 
 
Neuronal acetylcholine receptor subunit alpha-3/beta-4
Name:Neuronal acetylcholine receptor subunit alpha-3/beta-4
Type:n/a
Mol. Mass.:n/a
Description:ASSAY_ID of ChEMBL is 1970247
Components:This complex has 2 components.
Component 1
Name:Neuronal acetylcholine receptor subunit beta-4
Synonyms:ACHB4_HUMAN Cholinergic, Nicotinic Alpha6Beta3Beta4Alpha5 Nicotinic acetylcholine receptor alpha6/alpha3/beta4
Type:Enzyme Catalytic Domain
Mol. Mass.:56388.51
Organism:Homo sapiens (Human)
Description:Cholinergic, Nicotinic Alpha6Beta3Beta4Alpha5 0 HUMAN::P30926
Residue:498
Component 2
Name:Neuronal acetylcholine receptor subunit alpha-3
Synonyms:ACHA3_HUMAN Cholinergic, Nicotinic Alpha3Beta2 Cholinergic, Nicotinic Alpha3Beta4x NACHRA3 Neuronal acetylcholine receptor subunit alpha-3 nicotinic central
Type:Enzyme Catalytic Domain
Mol. Mass.:57479.03
Organism:Homo sapiens (Human)
Description:Cholinergic, Nicotinic Alpha3Beta2 0 HUMAN::P32297
Residue:505
BDBM50194315
NameBDBM50194315
Synonyms:(2R,2'S)-2-(1-methyl-2-pyrrolidinyl)-1,4-benzodioxane hydrochloride CHEMBL481368
TypeSmall organic molecule
Emp. Form.C13H17NO2
Mol. Mass.219.2796
SMILESCN1CCC[C@H]1[C@@H]1COc2ccccc2O1