Reaction Details
TargetNeuronal acetylcholine receptor subunit alpha-4/beta-2
LigandBDBM50259714
Substrate/Competitorn/a
Meas. Tech.ChEMBL_1691729 (CHEMBL4042378)
Ki 160±n/a nM
Citation Bolchi, CBavo, FGotti, CFumagalli, LFasoli, FBinda, MMucchietto, VSciaccaluga, MPlutino, SFucile, SPallavicini, M From pyrrolidinyl-benzodioxane to pyrrolidinyl-pyridodioxanes, or from unselective antagonism to selective partial agonism at?4?2 nicotinic acetylcholine receptor. Eur J Med Chem125:1132-1144 (2017) 
 
Neuronal acetylcholine receptor subunit alpha-4/beta-2
Name:Neuronal acetylcholine receptor subunit alpha-4/beta-2
Type:n/a
Mol. Mass.:n/a
Description:n/a
Components:This complex has 0 components.
Component 1
Name:Neuronal acetylcholine receptor subunit alpha-4
Synonyms:ACHA4_RAT Cholinergic, Nicotinic Alpha4Beta2 Chrna4 Neuronal acetylcholine receptor (alpha4beta2 nAChR) Neuronal acetylcholine receptor subunit alpha 4 beta 2 | Neuronal acetylcholine receptor subunit alpha-4
Type:Enzyme
Mol. Mass.:70196.44
Organism:Rattus norvegicus (Rat)
Description:P09483
Residue:630
Component 2
Name:Neuronal acetylcholine receptor subunit beta-2
Synonyms:ACHB2_RAT Chrnb2 Neuronal acetylcholine receptor non-alpha-1 chain
Type:Enzyme
Mol. Mass.:56910.32
Organism:Rattus norvegicus (Rat)
Description:P12390
Residue:500
BDBM50259714
NameBDBM50259714
Synonyms:CHEMBL4101001
TypeSmall organic molecule
Emp. Form.C13H15NO
Mol. Mass.201.2643
SMILESCN1CCC[C@H]1c1cc2ccccc2o1