Reaction Details
TargetHistone deacetylase 2
LigandBDBM50005711
Substrate/Competitorn/a
Meas. Tech.ChEBML_1691837
IC50 20.5±n/a nM
Citation Lee, HYLee, JFKumar, SWu, YWHuangFu, WCLai, MJLi, YHHuang, HLKuo, FCHsiao, CJCheng, CCYang, CRLiou, JP 3-Aroylindoles display antitumor activity in vitro and in vivo: Effects of N1-substituents on biological activity. Eur J Med Chem125:1268-1278 (2017) 
 
Histone deacetylase 2
Name:Histone deacetylase 2
Type:Chromatin regulator; hydrolase; repressor
Mol. Mass.:55356.54
Organism:Homo sapiens (Human)
Description:Q92769
Residue:488
BDBM50005711
NameBDBM50005711
Synonyms:CHEBI:46024 TRICHOSTATIN Trichostatin A (TSA) US10722597, Compound Trichostatin US20230322747, Compound trichostatin A | US9265734, TSA
TypeSmall organic molecule
Emp. Form.C17H22N2O3
Mol. Mass.302.3682
SMILESC[C@H](\C=C(/C)\C=C\C(=O)NO)C(=O)c1ccc(cc1)N(C)C