Reaction Details
TargetHistone deacetylase 4
LigandBDBM50446481
Substrate/Competitorn/a
Meas. Tech.ChEBML_1691852
IC50 127±n/a nM
Citation Lee, HYLee, JFKumar, SWu, YWHuangFu, WCLai, MJLi, YHHuang, HLKuo, FCHsiao, CJCheng, CCYang, CRLiou, JP 3-Aroylindoles display antitumor activity in vitro and in vivo: Effects of N1-substituents on biological activity. Eur J Med Chem125:1268-1278 (2017) 
 
Histone deacetylase 4
Name:Histone deacetylase 4
Type:Enzyme
Mol. Mass.:119049.39
Organism:Homo sapiens (Human)
Description:P56524
Residue:1084
BDBM50446481
NameBDBM50446481
Synonyms:CHEMBL3110004 US10722597, Compound TMP-269
TypeSmall organic molecule
Emp. Form.C25H21F3N4O3S
Mol. Mass.514.519
SMILESFC(F)(F)c1nc(no1)-c1cccc(c1)C(=O)NCC1(CCOCC1)c1nc(cs1)-c1ccccc1