Reaction Details
TargetHistone deacetylase 8
LigandBDBM50259808
Substrate/Competitorn/a
Meas. Tech.ChEBML_1691855
IC50 390±n/a nM
Citation Lee, HYLee, JFKumar, SWu, YWHuangFu, WCLai, MJLi, YHHuang, HLKuo, FCHsiao, CJCheng, CCYang, CRLiou, JP 3-Aroylindoles display antitumor activity in vitro and in vivo: Effects of N1-substituents on biological activity. Eur J Med Chem125:1268-1278 (2017) 
 
Histone deacetylase 8
Name:Histone deacetylase 8
Type:Enzyme
Mol. Mass.:41749.60
Organism:Homo sapiens (Human)
Description:Q9BY41
Residue:377
BDBM50259808
NameBDBM50259808
Synonyms:CHEMBL4093691
TypeSmall organic molecule
Emp. Form.C27H26N2O7
Mol. Mass.490.5045
SMILESCOc1ccc2c(cn(Cc3ccc(cc3)C(=O)NO)c2c1)C(=O)c1cc(OC)c(OC)c(OC)c1