Reaction Details
TargetPolyamine deacetylase HDAC10
LigandBDBM50259808
Substrate/Competitorn/a
Meas. Tech.ChEBML_1691857
IC50 8230±n/a nM
Citation Lee, HYLee, JFKumar, SWu, YWHuangFu, WCLai, MJLi, YHHuang, HLKuo, FCHsiao, CJCheng, CCYang, CRLiou, JP 3-Aroylindoles display antitumor activity in vitro and in vivo: Effects of N1-substituents on biological activity. Eur J Med Chem125:1268-1278 (2017) 
 
Polyamine deacetylase HDAC10
Name:Polyamine deacetylase HDAC10
Type:Chromatin regulator; hydrolase; repressor
Mol. Mass.:71431.89
Organism:Homo sapiens (Human)
Description:Q969S8
Residue:669
BDBM50259808
NameBDBM50259808
Synonyms:CHEMBL4093691
TypeSmall organic molecule
Emp. Form.C27H26N2O7
Mol. Mass.490.5045
SMILESCOc1ccc2c(cn(Cc3ccc(cc3)C(=O)NO)c2c1)C(=O)c1cc(OC)c(OC)c(OC)c1