Reaction Details
TargetCysteinyl leukotriene receptor 1
LigandBDBM50291858
Substrate/Competitorn/a
Meas. Tech.ChEBML_52358
Ki 2.5±n/a nM
Citation Huang, FCGalemmo, RAPoli, GBLearn, KSMorrissette, MMJohnson, WHDankulich, WPCampbell, HFCarnathan, GWVanInwegen, RG Development of a novel series of (2-quinolinylmethoxy)phenyl-containing compounds as high-affinity leukotriene D4 receptor antagonists. 4. Addition of chromone moiety enhances leukotriene D4 receptor binding affinity. J Med Chem34:1704-7 (1991) Cysteinyl leukotriene receptor 1
Name:Cysteinyl leukotriene receptor 1
Type:Enzyme Catalytic Domain
Mol. Mass.:39007.58
Organism:GUINEA PIG
Description:Leukotriene D4 0 GUINEA PIG::Q2NNR5
Residue:340
BDBM50291858
NameBDBM50291858
Synonyms:7-{2-[3-(Quinolin-2-ylmethoxy)-phenyl]-vinyl}-2-(1H-tetrazol-5-yl)-chroman-4-one | CHEMBL47376
TypeSmall organic molecule
Emp. Form.C28H21N5O3
Mol. Mass.475.498
SMILESO=C1CC(Oc2cc(\C=C\c3cccc(OCc4ccc5ccccc5n4)c3)ccc12)c1nnn[nH]1