Reaction Details
TargetCysteinyl leukotriene receptor 1
LigandBDBM50291848
Substrate/Competitorn/a
Meas. Tech.ChEBML_52358
Ki 0.300000±n/a nM
Citation Huang, FCGalemmo, RAPoli, GBLearn, KSMorrissette, MMJohnson, WHDankulich, WPCampbell, HFCarnathan, GWVanInwegen, RG Development of a novel series of (2-quinolinylmethoxy)phenyl-containing compounds as high-affinity leukotriene D4 receptor antagonists. 4. Addition of chromone moiety enhances leukotriene D4 receptor binding affinity. J Med Chem34:1704-7 (1991) Cysteinyl leukotriene receptor 1
Name:Cysteinyl leukotriene receptor 1
Type:Enzyme Catalytic Domain
Mol. Mass.:39007.58
Organism:GUINEA PIG
Description:Leukotriene D4 0 GUINEA PIG::Q2NNR5
Residue:340
BDBM50291848
NameBDBM50291848
Synonyms:7-{2-[3-(Quinolin-2-ylmethoxy)-phenyl]-ethyl}-2-(1H-tetrazol-5-yl)-chroman-4-one | CHEMBL44734
TypeSmall organic molecule
Emp. Form.C28H23N5O3
Mol. Mass.477.5139
SMILESO=C1CC(Oc2cc(CCc3cccc(OCc4ccc5ccccc5n4)c3)ccc12)c1nnn[nH]1