Reaction Details
TargetCysteinyl leukotriene receptor 1
LigandBDBM50291850
Substrate/Competitorn/a
Meas. Tech.ChEBML_52358
Ki 1.2±n/a nM
Citation Huang, FCGalemmo, RAPoli, GBLearn, KSMorrissette, MMJohnson, WHDankulich, WPCampbell, HFCarnathan, GWVanInwegen, RG Development of a novel series of (2-quinolinylmethoxy)phenyl-containing compounds as high-affinity leukotriene D4 receptor antagonists. 4. Addition of chromone moiety enhances leukotriene D4 receptor binding affinity. J Med Chem34:1704-7 (1991) Cysteinyl leukotriene receptor 1
Name:Cysteinyl leukotriene receptor 1
Type:Enzyme Catalytic Domain
Mol. Mass.:39007.58
Organism:GUINEA PIG
Description:Leukotriene D4 0 GUINEA PIG::Q2NNR5
Residue:340
BDBM50291850
NameBDBM50291850
Synonyms:3-{2-Methyl-4-oxo-7-[3-(quinolin-2-ylmethoxy)-benzyloxy]-chroman-2-yl}-propionic acid | CHEMBL296097
TypeSmall organic molecule
Emp. Form.C30H27NO6
Mol. Mass.497.5385
SMILESCC1(CCC(O)=O)CC(=O)c2ccc(OCc3cccc(OCc4ccc5ccccc5n4)c3)cc2O1