Reaction Details
TargetG-protein coupled receptor 35
LigandBDBM50131066
Substrate/Competitorn/a
Meas. Tech.ChEMBL_1691965 (CHEMBL4042614)
IC50 100000±n/a nM
Citation Wei, LWang, JZhang, XWang, PZhao, YLi, JHou, TQu, LShi, LLiang, XFang, Y Discovery of 2H-Chromen-2-one Derivatives as G Protein-Coupled Receptor-35 Agonists. J Med Chem60:362-372 (2017) 
 
G-protein coupled receptor 35
Name:G-protein coupled receptor 35
Type:Enzyme Catalytic Domain
Mol. Mass.:34085.57
Organism:Homo sapiens (Human)
Description:gi_33695097
Residue:309
BDBM50131066
NameBDBM50131066
Synonyms:2-Oxo-2H-chromene-3-carboxylic acid | CHEMBL83294
TypeSmall organic molecule
Emp. Form.C10H6O4
Mol. Mass.190.1522
SMILESOC(=O)c1cc2ccccc2oc1=O