Reaction Details
TargetG-protein coupled receptor 35
LigandBDBM50357187
Substrate/Competitorn/a
Meas. Tech.ChEMBL_1691962 (CHEMBL4042611)
EC50 32±n/a nM
Citation Wei, LWang, JZhang, XWang, PZhao, YLi, JHou, TQu, LShi, LLiang, XFang, Y Discovery of 2H-Chromen-2-one Derivatives as G Protein-Coupled Receptor-35 Agonists. J Med Chem60:362-372 (2017) 
 
G-protein coupled receptor 35
Name:G-protein coupled receptor 35
Type:Enzyme Catalytic Domain
Mol. Mass.:34085.57
Organism:Homo sapiens (Human)
Description:gi_33695097
Residue:309
BDBM50357187
NameBDBM50357187
Synonyms:CHEMBL1914576
TypeSmall organic molecule
Emp. Form.C16H9Cl2N3O
Mol. Mass.330.168
SMILES[#6]-[#6]1=[#6](C#N)\[#6](-[#8]C1([#6])c1ccc(Cl)c(Cl)c1)=[#6](\C#N)C#N