Reaction Details
TargetNeuronal acetylcholine receptor subunit alpha-7
LigandBDBM50259921
Substrate/Competitorn/a
Meas. Tech.ChEBML_1691998
EC50 35±n/a nM
Citation Hill, MDFang, HDigavalli, SVHealy, FLGallagher, LPost-Munson, DChen, PNatale, JBenitex, YMorgan, DLodge, NBristow, LMacor, JEOlson, RE Development of spiroguanidine-derived?7 neuronal nicotinic receptor partial agonists. Bioorg Med Chem Lett27:578-581 (2017) 
 
Neuronal acetylcholine receptor subunit alpha-7
Name:Neuronal acetylcholine receptor subunit alpha-7
Type:n/a
Mol. Mass.:56448.33
Organism:Homo sapiens (Human)
Description: CHRNA7 (NACHRA7)
Residue:502
BDBM50259921
NameBDBM50259921
Synonyms:CHEMBL4086223
TypeSmall organic molecule
Emp. Form.C17H21N5O
Mol. Mass.311.3815
SMILESCc1ccc2nc(NC3=NCC4(CN5CCC4CC5)N3)oc2c1