Reaction Details
TargetNeuronal acetylcholine receptor subunit alpha-7
LigandBDBM50259919
Substrate/Competitorn/a
Meas. Tech.ChEBML_1691996
EC50 200±n/a nM
Citation Hill, MDFang, HDigavalli, SVHealy, FLGallagher, LPost-Munson, DChen, PNatale, JBenitex, YMorgan, DLodge, NBristow, LMacor, JEOlson, RE Development of spiroguanidine-derived?7 neuronal nicotinic receptor partial agonists. Bioorg Med Chem Lett27:578-581 (2017) 
 
Neuronal acetylcholine receptor subunit alpha-7
Name:Neuronal acetylcholine receptor subunit alpha-7
Type:Enzyme
Mol. Mass.:56502.44
Organism:Rattus norvegicus (Rat)
Description:Q05941
Residue:502
BDBM50259919
NameBDBM50259919
Synonyms:CHEMBL4080813
TypeSmall organic molecule
Emp. Form.C16H19N5S
Mol. Mass.313.421
SMILESC1N=C(Nc2nc3ccccc3s2)NC11CN2CCC1CC2