Reaction Details
Target5-hydroxytryptamine receptor 3A
LigandBDBM50259947
Substrate/Competitorn/a
Meas. Tech.ChEBML_1691999
IC50 51±n/a nM
Citation Hill, MDFang, HDigavalli, SVHealy, FLGallagher, LPost-Munson, DChen, PNatale, JBenitex, YMorgan, DLodge, NBristow, LMacor, JEOlson, RE Development of spiroguanidine-derived?7 neuronal nicotinic receptor partial agonists. Bioorg Med Chem Lett27:578-581 (2017) 
 
5-hydroxytryptamine receptor 3A
Name:5-hydroxytryptamine receptor 3A
Type:Protein
Mol. Mass.:55283.27
Organism:Homo sapiens (Human)
Description:P46098
Residue:478
BDBM50259947
NameBDBM50259947
Synonyms:CHEMBL4085299
TypeSmall organic molecule
Emp. Form.C17H21N5OS
Mol. Mass.343.447
SMILESCOc1ccc2sc(NC3=NCC4(CN5CCC4CC5)N3)nc2c1