Reaction Details
TargetPotassium voltage-gated channel subfamily H member 2
LigandBDBM50259957
Substrate/Competitorn/a
Meas. Tech.ChEMBL_1692061 (CHEMBL4042710)
IC50 49200±n/a nM
Citation Butler, CROgilvie, KMartinez-Alsina, LBarreiro, GBeck, EMNolan, CEAtchison, KBenvenuti, EBuzon, LDoran, SGonzales, CHelal, CJHou, XHsu, MHJohnson, EFLapham, KLanyon, LParris, KO'Neill, BTRiddell, DRobshaw, AVajdos, FBrodney, MA Aminomethyl-Derived Beta Secretase (BACE1) Inhibitors: Engaging Gly230 without an Anilide Functionality. J Med Chem60:386-402 (2017) 
 
Potassium voltage-gated channel subfamily H member 2
Name:Potassium voltage-gated channel subfamily H member 2
Type:Multi-pass membrane protein
Mol. Mass.:126672.65
Organism:Homo sapiens (Human)
Description:Q12809
Residue:1159
BDBM50259957
NameBDBM50259957
Synonyms:CHEMBL4085715
TypeSmall organic molecule
Emp. Form.C15H19F2N3S
Mol. Mass.311.393
SMILESC[C@]1(CCSC(N)=N1)c1cc(CNC2CC2)c(F)cc1F