Reaction Details
TargetBeta-secretase 1
LigandBDBM50259967
Substrate/Competitorn/a
Meas. Tech.ChEMBL_1692055 (CHEMBL4042704)
IC50 53±n/a nM
Citation Butler, CROgilvie, KMartinez-Alsina, LBarreiro, GBeck, EMNolan, CEAtchison, KBenvenuti, EBuzon, LDoran, SGonzales, CHelal, CJHou, XHsu, MHJohnson, EFLapham, KLanyon, LParris, KO'Neill, BTRiddell, DRobshaw, AVajdos, FBrodney, MA Aminomethyl-Derived Beta Secretase (BACE1) Inhibitors: Engaging Gly230 without an Anilide Functionality. J Med Chem60:386-402 (2017) 
 
Beta-secretase 1
Name:Beta-secretase 1
Type:Protein
Mol. Mass.:55755.10
Organism:Homo sapiens (Human)
Description:P56817
Residue:501
BDBM50259967
NameBDBM50259967
Synonyms:CHEMBL4064708
TypeSmall organic molecule
Emp. Form.C16H23F2N3OS
Mol. Mass.343.435
SMILESCOCCCNCc1cc(c(F)cc1F)[C@]1(C)CCSC(N)=N1