Reaction Details
TargetBeta-secretase 1
LigandBDBM50259962
Substrate/Competitorn/a
Meas. Tech.ChEBML_1692052
IC50 78±n/a nM
Citation Butler, CROgilvie, KMartinez-Alsina, LBarreiro, GBeck, EMNolan, CEAtchison, KBenvenuti, EBuzon, LDoran, SGonzales, CHelal, CJHou, XHsu, MHJohnson, EFLapham, KLanyon, LParris, KO'Neill, BTRiddell, DRobshaw, AVajdos, FBrodney, MA Aminomethyl-Derived Beta Secretase (BACE1) Inhibitors: Engaging Gly230 without an Anilide Functionality. J Med Chem60:386-402 (2017) 
 
Beta-secretase 1
Name:Beta-secretase 1
Type:Protein
Mol. Mass.:55755.10
Organism:Homo sapiens (Human)
Description:P56817
Residue:501
BDBM50259962
NameBDBM50259962
Synonyms:CHEMBL4088234
TypeSmall organic molecule
Emp. Form.C17H20F5N3S
Mol. Mass.393.418
SMILESC[C@@H]1C[C@](C)(N=C(N)S1)c1cc(CNC2(CC2)C(F)(F)F)c(F)cc1F