Reaction Details
TargetG protein-coupled receptor kinase 5
LigandBDBM50173320
Substrate/Competitorn/a
Meas. Tech.ChEBML_1692746
IC50>100000±n/a nM
Citation Waldschmidt, HVHoman, KTCato, MCCruz-Rodríguez, OCannavo, AWilson, MWSong, JCheung, JYKoch, WJTesmer, JJLarsen, SD Structure-Based Design of Highly Selective and Potent G Protein-Coupled Receptor Kinase 2 Inhibitors Based on Paroxetine. J Med Chem60:3052-3069 (2017) 
 
G protein-coupled receptor kinase 5
Name:G protein-coupled receptor kinase 5
Type:PROTEIN
Mol. Mass.:67903.06
Organism:Bos taurus
Description:ChEMBL_116955
Residue:590
BDBM50173320
NameBDBM50173320
Synonyms:GSK-180736A US10023564, Compound GSK180736A
TypeSmall organic molecule
Emp. Form.C19H16FN5O2
Mol. Mass.365.361
SMILESCC1=C(C(NC(=O)N1)c1ccc(F)cc1)C(=O)Nc1ccc2[nH]ncc2c1