Reaction Details
TargetG protein-coupled receptor kinase 5
LigandBDBM50257350
Substrate/Competitorn/a
Meas. Tech.ChEBML_1692746
IC50 9200±n/a nM
Citation Waldschmidt, HVHoman, KTCato, MCCruz-Rodríguez, OCannavo, AWilson, MWSong, JCheung, JYKoch, WJTesmer, JJLarsen, SD Structure-Based Design of Highly Selective and Potent G Protein-Coupled Receptor Kinase 2 Inhibitors Based on Paroxetine. J Med Chem60:3052-3069 (2017) 
 
G protein-coupled receptor kinase 5
Name:G protein-coupled receptor kinase 5
Type:PROTEIN
Mol. Mass.:67903.06
Organism:Bos taurus
Description:ChEMBL_116955
Residue:590
BDBM50257350
NameBDBM50257350
Synonyms:CHEMBL1738877
TypeSmall organic molecule
Emp. Form.C24H21F3N6O
Mol. Mass.466.4583
SMILESCn1c(CNc2cccc(c2)C(=O)NCc2ccccc2C(F)(F)F)nnc1-c1ccncc1