Reaction Details
TargetRhodopsin kinase GRK1
LigandBDBM50260152
Substrate/Competitorn/a
Meas. Tech.ChEBML_1692745
IC50>100000±n/a nM
Citation Waldschmidt, HVHoman, KTCato, MCCruz-Rodríguez, OCannavo, AWilson, MWSong, JCheung, JYKoch, WJTesmer, JJLarsen, SD Structure-Based Design of Highly Selective and Potent G Protein-Coupled Receptor Kinase 2 Inhibitors Based on Paroxetine. J Med Chem60:3052-3069 (2017) 
 
Rhodopsin kinase GRK1
Name:Rhodopsin kinase GRK1
Type:PROTEIN
Mol. Mass.:62931.24
Organism:Bos taurus
Description:ChEMBL_116985
Residue:561
BDBM50260152
NameBDBM50260152
Synonyms:CHEMBL4105100
TypeSmall organic molecule
Emp. Form.C25H27FN4O4
Mol. Mass.466.5047
SMILESCn1nccc1CNC(=O)c1cc(ccc1F)[C@@H]1CCNC[C@H]1COc1ccc2OCOc2c1