Reaction Details
TargetFibroblast growth factor receptor 2
LigandBDBM50260190
Substrate/Competitorn/a
Meas. Tech.ChEBML_1692888
IC50 1.2±n/a nM
Citation Li, XGuise, CPTaghipouran, RYosaatmadja, YAshoorzadeh, APaik, WKSquire, CJJiang, SLuo, JXu, YTu, ZCLu, XRen, XPatterson, AVSmaill, JBDing, K 2-Oxo-3, 4-dihydropyrimido[4, 5-d]pyrimidinyl derivatives as new irreversible pan fibroblast growth factor receptor (FGFR) inhibitors. Eur J Med Chem135:531-543 (2017) 
 
Fibroblast growth factor receptor 2
Name:Fibroblast growth factor receptor 2
Type:Enzyme
Mol. Mass.:92015.45
Organism:Homo sapiens (Human)
Description:P21802
Residue:821
BDBM50260190
NameBDBM50260190
Synonyms:CHEMBL4100258
TypeSmall organic molecule
Emp. Form.C32H37Cl2N7O5
Mol. Mass.670.586
SMILESCOc1ccc(Nc2ncc3CN(C(=O)N(C4CCN(CC4)C(=O)\C=C\CN(C)C)c3n2)c2c(Cl)c(OC)cc(OC)c2Cl)cc1