Reaction Details
TargetFibroblast growth factor receptor 2
LigandBDBM50260188
Substrate/Competitorn/a
Meas. Tech.ChEBML_1692888
IC50 2.6±n/a nM
Citation Li, XGuise, CPTaghipouran, RYosaatmadja, YAshoorzadeh, APaik, WKSquire, CJJiang, SLuo, JXu, YTu, ZCLu, XRen, XPatterson, AVSmaill, JBDing, K 2-Oxo-3, 4-dihydropyrimido[4, 5-d]pyrimidinyl derivatives as new irreversible pan fibroblast growth factor receptor (FGFR) inhibitors. Eur J Med Chem135:531-543 (2017) 
 
Fibroblast growth factor receptor 2
Name:Fibroblast growth factor receptor 2
Type:Enzyme
Mol. Mass.:92015.45
Organism:Homo sapiens (Human)
Description:P21802
Residue:821
BDBM50260188
NameBDBM50260188
Synonyms:CHEMBL4069509
TypeSmall organic molecule
Emp. Form.C28H37Cl2N7O4
Mol. Mass.606.544
SMILESCOc1cc(OC)c(Cl)c(N2Cc3cnc(NC(C)C)nc3N(C3CCN(CC3)C(=O)\C=C\CN(C)C)C2=O)c1Cl