Reaction Details
TargetFibroblast growth factor receptor 1
LigandBDBM50260184
Substrate/Competitorn/a
Meas. Tech.ChEBML_1692887
IC50 1.2±n/a nM
Citation Li, XGuise, CPTaghipouran, RYosaatmadja, YAshoorzadeh, APaik, WKSquire, CJJiang, SLuo, JXu, YTu, ZCLu, XRen, XPatterson, AVSmaill, JBDing, K 2-Oxo-3, 4-dihydropyrimido[4, 5-d]pyrimidinyl derivatives as new irreversible pan fibroblast growth factor receptor (FGFR) inhibitors. Eur J Med Chem135:531-543 (2017) 
 
Fibroblast growth factor receptor 1
Name:Fibroblast growth factor receptor 1
Type:Receptor
Mol. Mass.:91861.70
Organism:Homo sapiens (Human)
Description:P11362
Residue:822
BDBM50260184
NameBDBM50260184
Synonyms:CHEMBL4068733
TypeSmall organic molecule
Emp. Form.C32H37Cl2N7O5
Mol. Mass.670.586
SMILESCOc1cccc(Nc2ncc3CN(C(=O)N(C4CCN(CC4)C(=O)\C=C\CN(C)C)c3n2)c2c(Cl)c(OC)cc(OC)c2Cl)c1