Reaction Details
TargetAldo-keto reductase family 1 member B1
LigandBDBM50009749
Substrate/Competitorn/a
Meas. Tech.ChEBML_157078
IC50 6.2±n/a nM
Citation Mylari, BLLarson, ERBeyer, TAZembrowski, WJAldinger, CEDee, MFSiegel, TWSingleton, DH Novel, potent aldose reductase inhibitors: 3,4-dihydro-4-oxo-3-[[5-(trifluoromethyl)-2-benzothiazolyl] methyl]-1-phthalazineacetic acid (zopolrestat) and congeners. J Med Chem34:108-22 (1991) Aldo-keto reductase family 1 member B1
Name:Aldo-keto reductase family 1 member B1
Type:Protein
Mol. Mass.:35855.50
Organism:Homo sapiens (Human)
Description:P15121. 4LAU; 2IKI; 4LB4; 2FZD; 2FZ8; 1US0
Residue:316
BDBM50009749
NameBDBM50009749
Synonyms:CHEMBL416001 | [3-(7-Chloro-5-fluoro-benzothiazol-2-ylmethyl)-4-oxo-3,4-dihydro-phthalazin-1-yl]-acetic acid
TypeSmall organic molecule
Emp. Form.C18H11ClFN3O3S
Mol. Mass.403.815
SMILESOC(=O)Cc1nn(Cc2nc3cc(F)cc(Cl)c3s2)c(=O)c2ccccc12