Reaction Details
TargetPolyunsaturated fatty acid 5-lipoxygenase
LigandBDBM50009931
Substrate/Competitorn/a
Meas. Tech.ChEBML_734
IC50 480±n/a nM
Citation Hlasta, DJCasey, FBFerguson, EWGangell, SJHeimann, MRJaeger, EPKullnig, RKGordon, RJ 5-Lipoxygenase inhibitors: the synthesis and structure-activity relationships of a series of 1-phenyl-3-pyrazolidinones. J Med Chem34:1560-70 (1991) Polyunsaturated fatty acid 5-lipoxygenase
Name:Polyunsaturated fatty acid 5-lipoxygenase
Type:PROTEIN
Mol. Mass.:78082.31
Organism:Rattus norvegicus
Description:ChEMBL_1432947
Residue:673
BDBM50009931
NameBDBM50009931
Synonyms:4-(2-Methoxy-ethyl)-1-phenyl-pyrazolidin-3-one | CHEMBL291227
TypeSmall organic molecule
Emp. Form.C12H16N2O2
Mol. Mass.220.2676
SMILESCOCCC1CN(NC1=O)c1ccccc1