Reaction Details
TargetPolyunsaturated fatty acid 5-lipoxygenase
LigandBDBM50009958
Substrate/Competitorn/a
Meas. Tech.ChEBML_734
IC50 180±n/a nM
Citation Hlasta, DJCasey, FBFerguson, EWGangell, SJHeimann, MRJaeger, EPKullnig, RKGordon, RJ 5-Lipoxygenase inhibitors: the synthesis and structure-activity relationships of a series of 1-phenyl-3-pyrazolidinones. J Med Chem34:1560-70 (1991) Polyunsaturated fatty acid 5-lipoxygenase
Name:Polyunsaturated fatty acid 5-lipoxygenase
Type:PROTEIN
Mol. Mass.:78082.31
Organism:Rattus norvegicus
Description:ChEMBL_1432947
Residue:673
BDBM50009958
NameBDBM50009958
Synonyms:4-Benzylsulfanyl-1-phenyl-pyrazolidin-3-one | CHEMBL36908
TypeSmall organic molecule
Emp. Form.C16H16N2OS
Mol. Mass.284.376
SMILESO=C1NN(CC1SCc1ccccc1)c1ccccc1