Reaction Details
TargetProstaglandin G/H synthase 2
LigandBDBM50260477
Substrate/Competitorn/a
Meas. Tech.ChEBML_1693913
IC50 1300±n/a nM
Citation Zhou, SYang, SHuang, G Design, synthesis and bioactivities of Celecoxib analogues or derivatives. Bioorg Med Chem25:4887-4893 (2017) 
 
Prostaglandin G/H synthase 2
Name:Prostaglandin G/H synthase 2
Type:Enzyme Catalytic Domain
Mol. Mass.:69173.51
Organism:RAT
Description:COX-2 0 RAT::P35355
Residue:604
BDBM50260477
NameBDBM50260477
Synonyms:CHEMBL4083020
TypeSmall organic molecule
Emp. Form.C15H15F3N4O3S
Mol. Mass.388.365
SMILESCN1C=CN(C=C1)C1OC(=CN1c1ccc(cc1)S(N)(=O)=O)C(F)(F)F