Reaction Details
TargetThromboxane A2 receptor
LigandBDBM50010073
Substrate/Competitorn/a
Meas. Tech.ChEBML_209599
Kd 1±n/a nM
Citation Misra, RNBrown, BRHan, WCHarris, DNHedberg, AWebb, MLHall, SE Interphenylene 7-oxabicyclo[2.2.1]heptane thromboxane A2 antagonists. Semicarbazone omega-chains. J Med Chem34:2882-91 (1991) Thromboxane A2 receptor
Name:Thromboxane A2 receptor
Type:Enyzme
Mol. Mass.:37445.28
Organism:Homo sapiens (Human)
Description:P21731
Residue:343
BDBM50010073
NameBDBM50010073
Synonyms:3-(2-{3-[(E)-Phenylcarbamoylmethylimino-amino]-7-oxa-bicyclo[2.2.1]hept-2-ylmethyl}-phenyl)-propionic acid CHEMBL95872
TypeSmall organic molecule
Emp. Form.C24H27N3O4
Mol. Mass.421.4889
SMILESOC(=O)CCc1ccccc1CC1C2CCC(O2)C1C=NNC(=O)Nc1ccccc1