Reaction Details
TargetThromboxane A2 receptor
LigandBDBM50010077
Substrate/Competitorn/a
Meas. Tech.ChEBML_209599
Kd 21±n/a nM
Citation Misra, RNBrown, BRHan, WCHarris, DNHedberg, AWebb, MLHall, SE Interphenylene 7-oxabicyclo[2.2.1]heptane thromboxane A2 antagonists. Semicarbazone omega-chains. J Med Chem34:2882-91 (1991) Thromboxane A2 receptor
Name:Thromboxane A2 receptor
Type:Enyzme
Mol. Mass.:37445.28
Organism:Homo sapiens (Human)
Description:P21731
Residue:343
BDBM50010077
NameBDBM50010077
Synonyms:4-[2-(5-oxabicyclo[2.2.1],3-formaldehyde (anilinocarbonyl)hydrazonehept-2-ylmethyl)phenyl]butanoic acid | CHEMBL95867
TypeSmall organic molecule
Emp. Form.C25H29N3O4
Mol. Mass.435.5155
SMILESOC(=O)CCCc1ccccc1CC1C2CCC(O2)C1C=NNC(=O)Nc1ccccc1