Reaction Details
TargetThromboxane A2 receptor
LigandBDBM50010076
Substrate/Competitorn/a
Meas. Tech.ChEBML_209599
Kd 1070±n/a nM
Citation Misra, RNBrown, BRHan, WCHarris, DNHedberg, AWebb, MLHall, SE Interphenylene 7-oxabicyclo[2.2.1]heptane thromboxane A2 antagonists. Semicarbazone omega-chains. J Med Chem34:2882-91 (1991) Thromboxane A2 receptor
Name:Thromboxane A2 receptor
Type:Enyzme
Mol. Mass.:37445.28
Organism:Homo sapiens (Human)
Description:P21731
Residue:343
BDBM50010076
NameBDBM50010076
Synonyms:CHEMBL99348 | {3-[2-(5-oxabicyclo[2.2.1],3-formaldehyde(anilinocarbonyl)hydrazone,hept-2-yl)ethyl]phenyl}acetic acid
TypeSmall organic molecule
Emp. Form.C24H27N3O4
Mol. Mass.421.4889
SMILESOC(=O)Cc1cccc(CCC2C3CCC(O3)C2C=NNC(=O)Nc2ccccc2)c1