Reaction Details
TargetSigma non-opioid intracellular receptor 1
LigandBDBM50260586
Substrate/Competitorn/a
Meas. Tech.ChEBML_1694030
Ki 0.510000±n/a nM
Citation Fanter, LMüller, CSchepmann, DBracher, FWünsch, B Chiral-pool synthesis of 1,2,4-trisubstituted 1,4-diazepanes as novel? Bioorg Med Chem25:4778-4799 (2017) 
 
Sigma non-opioid intracellular receptor 1
Name:Sigma non-opioid intracellular receptor 1
Type:Protein
Mol. Mass.:25307.17
Organism:Cavia porcellus (Guinea pig)
Description:Q60492
Residue:223
BDBM50260586
NameBDBM50260586
Synonyms:CHEMBL4065105
TypeSmall organic molecule
Emp. Form.C21H28N2O
Mol. Mass.324.4598
SMILESCOc1ccc(CN2CCCN(Cc3ccccc3)[C@H](C)C2)cc1