Reaction Details
TargetSigma non-opioid intracellular receptor 1
LigandBDBM50260594
Substrate/Competitorn/a
Meas. Tech.ChEBML_1694030
Ki 0.610000±n/a nM
Citation Fanter, LMüller, CSchepmann, DBracher, FWünsch, B Chiral-pool synthesis of 1,2,4-trisubstituted 1,4-diazepanes as novel? Bioorg Med Chem25:4778-4799 (2017) 
 
Sigma non-opioid intracellular receptor 1
Name:Sigma non-opioid intracellular receptor 1
Type:Protein
Mol. Mass.:25307.17
Organism:Cavia porcellus (Guinea pig)
Description:Q60492
Residue:223
BDBM50260594
NameBDBM50260594
Synonyms:CHEMBL4090896
TypeSmall organic molecule
Emp. Form.C17H28N2
Mol. Mass.260.4176
SMILESCCCCN1CCCN(Cc2ccccc2)[C@@H](C)C1