Reaction Details
TargetBromodomain-containing protein 4
LigandBDBM50028142
Substrate/Competitorn/a
Meas. Tech.ChEBML_1694131
IC50 22±n/a nM
Citation Shao, MHe, LZheng, LHuang, LZhou, YWang, TChen, YShen, MWang, FYang, ZChen, L Structure-based design, synthesis and in vitro antiproliferative effects studies of novel dual BRD4/HDAC inhibitors. Bioorg Med Chem Lett27:4051-4055 (2017) 
 
Bromodomain-containing protein 4
Name:Bromodomain-containing protein 4
Type:Protein
Mol. Mass.:152264.84
Organism:Homo sapiens (Human)
Description:O60885
Residue:1362
BDBM50028142
NameBDBM50028142
Synonyms:CHEMBL2177300
TypeSmall organic molecule
Emp. Form.C25H23ClN2O3
Mol. Mass.434.915
SMILESC[C@H]1C[C@@H](Nc2ccc(Cl)cc2)c2cc(ccc2N1C(C)=O)-c1ccc(cc1)C(O)=O