Reaction Details
TargetD(2) dopamine receptor
LigandBDBM50260599
Substrate/Competitorn/a
Meas. Tech.ChEBML_1694214
IC50 3.3±n/a nM
Citation Xiamuxi, HWang, ZLi, JWang, YWu, CYang, FJiang, XLiu, YZhao, QChen, WZhang, JXie, YHu, TXu, MGuo, SAkber Aisa, HHe, YShen, J Synthesis and biological investigation of tetrahydropyridopyrimidinone derivatives as potential multireceptor atypical antipsychotics. Bioorg Med Chem25:4904-4916 (2017) 
 
D(2) dopamine receptor
Name:D(2) dopamine receptor
Type:Cell-surface receptors
Mol. Mass.:50647.10
Organism:Homo sapiens (Human)
Description:P14416
Residue:443
BDBM50260599
NameBDBM50260599
Synonyms:CHEMBL4094825
TypeSmall organic molecule
Emp. Form.C23H24N4OS
Mol. Mass.404.528
SMILESCc1nc2ccccn2c(=O)c1CCN1CCN(CC1)c1cccc2sccc12