Reaction Details
TargetD(2) dopamine receptor
LigandBDBM319613
Substrate/Competitorn/a
Meas. Tech.ChEBML_1694214
IC50 3.3±n/a nM
Citation Xiamuxi, HWang, ZLi, JWang, YWu, CYang, FJiang, XLiu, YZhao, QChen, WZhang, JXie, YHu, TXu, MGuo, SAkber Aisa, HHe, YShen, J Synthesis and biological investigation of tetrahydropyridopyrimidinone derivatives as potential multireceptor atypical antipsychotics. Bioorg Med Chem25:4904-4916 (2017) 
 
D(2) dopamine receptor
Name:D(2) dopamine receptor
Type:Cell-surface receptors
Mol. Mass.:50647.10
Organism:Homo sapiens (Human)
Description:P14416
Residue:443
BDBM319613
NameBDBM319613
Synonyms:3-(2-(4-(benzo[b]thiophen-4-yl)piperazin-1-yl)ethyl)-9-fluoro-2-methyl-6,7,8,9-tetrahydro-4H-pyrido[1,2-a]pyrimidin-4-one | US10174011, Example 7
TypeSmall organic molecule
Emp. Form.C23H27FN4OS
Mol. Mass.426.55
SMILESCc1nc2C(F)CCCn2c(=O)c1CCN1CCN(CC1)c1cccc2sccc12