Reaction Details
TargetCyclin-C/Cyclin-dependent kinase 8
LigandBDBM50260952
Substrate/Competitorn/a
Meas. Tech.ChEMBL_1695228 (CHEMBL4046118)
IC50 3±n/a nM
Citation Han, XJiang, MZhou, CZhou, ZXu, ZWang, LMayweg, AVNiu, RJin, TGYang, S Discovery of potent and selective CDK8 inhibitors through FBDD approach. Bioorg Med Chem Lett27:4488-4492 (2017) 
 
Cyclin-C/Cyclin-dependent kinase 8
Name:Cyclin-C/Cyclin-dependent kinase 8
Synonyms:CDK8/Cyclin C
Type:n/a
Mol. Mass.:n/a
Description:ASSAY_ID of ChEMBL is 1562017
Components:This complex has 2 components.
Component 1
Name:Cyclin-dependent kinase 8
Type:Serine/threonine-protein kinase
Mol. Mass.:53300.21
Organism:Homo sapiens (Human)
Description:P49336
Residue:464
Component 2
Name:Cyclin-C
Synonyms:CCNC Cyclin C hSRB11
Type:PROTEIN
Mol. Mass.:33244.88
Organism:Homo sapiens (Human)
Description:ChEMBL_107900
Residue:283
BDBM50260952
NameBDBM50260952
Synonyms:CHEMBL4104489
TypeSmall organic molecule
Emp. Form.C11H8F3N3O
Mol. Mass.255.1959
SMILESNC(=O)c1[nH]cc(c1C(F)(F)F)-c1ccncc1