Reaction Details
TargetAldo-keto reductase family 1 member B1
LigandBDBM50049730
Substrate/Competitorn/a
Meas. Tech.ChEBML_1695281
IC50 94±n/a nM
Citation Xiu, ZMWang, LPFu, JXu, JLiu, L 1-Acetyl-5-phenyl-1H-pyrrol-3-ylacetate: An aldose reductase inhibitor for the treatment of diabetic nephropathy. Bioorg Med Chem Lett27:4482-4487 (2017) 
 
Aldo-keto reductase family 1 member B1
Name:Aldo-keto reductase family 1 member B1
Type:Protein
Mol. Mass.:35855.50
Organism:Homo sapiens (Human)
Description:P15121. 4LAU; 2IKI; 4LB4; 2FZD; 2FZ8; 1US0
Residue:316
BDBM50049730
NameBDBM50049730
Synonyms:2-(5-(2-methyl-3-phenylallylidene)-4-oxo-2-thioxothiazolidin-3-yl)acetic acid Epalrestat | {5-[(E)-2-Methyl-3-phenyl-prop-2-en-(Z)-ylidene]-4-oxo-2-thioxo-thiazolidin-3-yl}-acetic acid
TypeSmall organic molecule
Emp. Form.C15H13NO3S2
Mol. Mass.319.399
SMILESC\C(\C=C1/SC(=S)N(CC(O)=O)C1=O)=C/c1ccccc1