Reaction Details
TargetSodium channel protein type 9 subunit alpha
LigandBDBM50261077
Substrate/Competitorn/a
Meas. Tech.ChEBML_1695592
IC50 78±n/a nM
Citation Wu, YJGuernon, JMcClure, ALuo, GRajamani, RNg, AEaston, ANewton, ABourin, CParker, DMosure, KBarnaby, OSoars, MGKnox, RJMatchett, MPieschl, RHerrington, JChen, PSivarao, DVBristow, LJMeanwell, NABronson, JOlson, RThompson, LADzierba, C Discovery of non-zwitterionic aryl sulfonamides as Na Bioorg Med Chem25:5490-5505 (2017) 
 
Sodium channel protein type 9 subunit alpha
Name:Sodium channel protein type 9 subunit alpha
Type:Protein
Mol. Mass.:226375.97
Organism:Homo sapiens (Human)
Description:Q15858
Residue:1988
BDBM50261077
NameBDBM50261077
Synonyms:CHEMBL4072883
TypeSmall organic molecule
Emp. Form.C15H17ClFN3O3S2
Mol. Mass.405.895
SMILESFc1cc(NC[C@H]2CCCOC2)c(Cl)cc1S(=O)(=O)Nc1nccs1