Reaction Details
TargetSodium channel protein type 5 subunit alpha
LigandBDBM50261075
Substrate/Competitorn/a
Meas. Tech.ChEBML_1695597
IC50 74±n/a nM
Citation Wu, YJGuernon, JMcClure, ALuo, GRajamani, RNg, AEaston, ANewton, ABourin, CParker, DMosure, KBarnaby, OSoars, MGKnox, RJMatchett, MPieschl, RHerrington, JChen, PSivarao, DVBristow, LJMeanwell, NABronson, JOlson, RThompson, LADzierba, C Discovery of non-zwitterionic aryl sulfonamides as Na Bioorg Med Chem25:5490-5505 (2017) 
 
Sodium channel protein type 5 subunit alpha
Name:Sodium channel protein type 5 subunit alpha
Type:Enzyme
Mol. Mass.:226908.60
Organism:Homo sapiens (Human)
Description:Q14524
Residue:2016
BDBM50261075
NameBDBM50261075
Synonyms:CHEMBL4087220 | US10836758, Example 7
TypeSmall organic molecule
Emp. Form.C14H15ClFN3O4S2
Mol. Mass.407.868
SMILESFc1cc(NCC2COCCO2)c(Cl)cc1S(=O)(=O)Nc1nccs1