Reaction Details
TargetSodium channel protein type 5 subunit alpha
LigandBDBM50261072
Substrate/Competitorn/a
Meas. Tech.ChEMBL_1695597 (CHEMBL4046487)
IC50 328±n/a nM
Citation Wu, YJGuernon, JMcClure, ALuo, GRajamani, RNg, AEaston, ANewton, ABourin, CParker, DMosure, KBarnaby, OSoars, MGKnox, RJMatchett, MPieschl, RHerrington, JChen, PSivarao, DVBristow, LJMeanwell, NABronson, JOlson, RThompson, LADzierba, C Discovery of non-zwitterionic aryl sulfonamides as Na Bioorg Med Chem25:5490-5505 (2017) 
 
Sodium channel protein type 5 subunit alpha
Name:Sodium channel protein type 5 subunit alpha
Type:Enzyme
Mol. Mass.:226908.60
Organism:Homo sapiens (Human)
Description:Q14524
Residue:2016
BDBM50261072
NameBDBM50261072
Synonyms:CHEMBL4092025
TypeSmall organic molecule
Emp. Form.C15H17ClFN3O3S2
Mol. Mass.405.895
SMILESFc1cc(NC[C@@H]2CCCOC2)c(Cl)cc1S(=O)(=O)Nc1nccs1