Reaction Details
TargetTyrosine-protein kinase JAK2
LigandBDBM50261255
Substrate/Competitorn/a
Meas. Tech.ChEMBL_1695704 (CHEMBL4046594)
EC50 1300±n/a nM
Citation Liang, JVan Abbema, ABalazs, MBarrett, KBerezhkovsky, LBlair, WSChang, CDelarosa, DDeVoss, JDriscoll, JEigenbrot, CGoodacre, SGhilardi, NMacLeod, CJohnson, ABir Kohli, PLai, YLin, ZMantik, PMenghrajani, KNguyen, HPeng, ISambrone, AShia, SSmith, JSohn, STsui, VUltsch, MWilliams, KWu, LCYang, WZhang, BMagnuson, S Identification of an imidazopyridine scaffold to generate potent and selective TYK2 inhibitors that demonstrate activity in an in vivo psoriasis model. Bioorg Med Chem Lett27:4370-4376 (2017) 
 
Tyrosine-protein kinase JAK2
Name:Tyrosine-protein kinase JAK2
Type:Protein
Mol. Mass.:130684.68
Organism:Homo sapiens (Human)
Description:O60674
Residue:1132
BDBM50261255
NameBDBM50261255
Synonyms:CHEMBL4084436
TypeSmall organic molecule
Emp. Form.C16H11Cl2N7
Mol. Mass.372.211
SMILESNc1cc(Nc2nccc3nc([nH]c23)-c2c(Cl)cccc2Cl)ncn1