Reaction Details
TargetTyrosine-protein kinase JAK2
LigandBDBM50261283
Substrate/Competitorn/a
Meas. Tech.ChEMBL_1695700 (CHEMBL4046590)
Ki 6.6±n/a nM
Citation Liang, JVan Abbema, ABalazs, MBarrett, KBerezhkovsky, LBlair, WSChang, CDelarosa, DDeVoss, JDriscoll, JEigenbrot, CGoodacre, SGhilardi, NMacLeod, CJohnson, ABir Kohli, PLai, YLin, ZMantik, PMenghrajani, KNguyen, HPeng, ISambrone, AShia, SSmith, JSohn, STsui, VUltsch, MWilliams, KWu, LCYang, WZhang, BMagnuson, S Identification of an imidazopyridine scaffold to generate potent and selective TYK2 inhibitors that demonstrate activity in an in vivo psoriasis model. Bioorg Med Chem Lett27:4370-4376 (2017) 
 
Tyrosine-protein kinase JAK2
Name:Tyrosine-protein kinase JAK2
Type:Protein
Mol. Mass.:130684.68
Organism:Homo sapiens (Human)
Description:O60674
Residue:1132
BDBM50261283
NameBDBM50261283
Synonyms:CHEMBL4093172
TypeSmall organic molecule
Emp. Form.C17H12Cl2N2OS
Mol. Mass.363.261
SMILESClc1cccc(Cl)c1-c1cc2ccnc(NC(=O)C3CC3)c2s1