Reaction Details
TargetTyrosine-protein kinase JAK2
LigandBDBM50261215
Substrate/Competitorn/a
Meas. Tech.ChEMBL_1695704 (CHEMBL4046594)
EC50 2250±n/a nM
Citation Liang, JVan Abbema, ABalazs, MBarrett, KBerezhkovsky, LBlair, WSChang, CDelarosa, DDeVoss, JDriscoll, JEigenbrot, CGoodacre, SGhilardi, NMacLeod, CJohnson, ABir Kohli, PLai, YLin, ZMantik, PMenghrajani, KNguyen, HPeng, ISambrone, AShia, SSmith, JSohn, STsui, VUltsch, MWilliams, KWu, LCYang, WZhang, BMagnuson, S Identification of an imidazopyridine scaffold to generate potent and selective TYK2 inhibitors that demonstrate activity in an in vivo psoriasis model. Bioorg Med Chem Lett27:4370-4376 (2017) 
 
Tyrosine-protein kinase JAK2
Name:Tyrosine-protein kinase JAK2
Type:Protein
Mol. Mass.:130684.68
Organism:Homo sapiens (Human)
Description:O60674
Residue:1132
BDBM50261215
NameBDBM50261215
Synonyms:CHEMBL2387223
TypeSmall organic molecule
Emp. Form.C17H11ClF2N4O2
Mol. Mass.376.745
SMILESF[C@@H]1C[C@@H]1C(=O)Nc1cc(NC(=O)c2c(F)cc(cc2Cl)C#N)ccn1