Reaction Details
TargetNon-receptor tyrosine-protein kinase TYK2
LigandBDBM50261271
Substrate/Competitorn/a
Meas. Tech.ChEBML_1695702
Ki 1.2±n/a nM
Citation Liang, JVan Abbema, ABalazs, MBarrett, KBerezhkovsky, LBlair, WSChang, CDelarosa, DDeVoss, JDriscoll, JEigenbrot, CGoodacre, SGhilardi, NMacLeod, CJohnson, ABir Kohli, PLai, YLin, ZMantik, PMenghrajani, KNguyen, HPeng, ISambrone, AShia, SSmith, JSohn, STsui, VUltsch, MWilliams, KWu, LCYang, WZhang, BMagnuson, S Identification of an imidazopyridine scaffold to generate potent and selective TYK2 inhibitors that demonstrate activity in an in vivo psoriasis model. Bioorg Med Chem Lett27:4370-4376 (2017) 
 
Non-receptor tyrosine-protein kinase TYK2
Name:Non-receptor tyrosine-protein kinase TYK2
Type:Protein
Mol. Mass.:133666.03
Organism:Homo sapiens (Human)
Description:P29597
Residue:1187
BDBM50261271
NameBDBM50261271
Synonyms:CHEMBL4080904
TypeSmall organic molecule
Emp. Form.C22H22Cl2N8O
Mol. Mass.485.369
SMILESOCCN1CCN(CC1)c1cc(Nc2nccc3nc([nH]c23)-c2c(Cl)cccc2Cl)ncn1