Reaction Details
TargetNon-receptor tyrosine-protein kinase TYK2
LigandBDBM50434821
Substrate/Competitorn/a
Meas. Tech.ChEBML_1695702
Ki 4.8±n/a nM
Citation Liang, JVan Abbema, ABalazs, MBarrett, KBerezhkovsky, LBlair, WSChang, CDelarosa, DDeVoss, JDriscoll, JEigenbrot, CGoodacre, SGhilardi, NMacLeod, CJohnson, ABir Kohli, PLai, YLin, ZMantik, PMenghrajani, KNguyen, HPeng, ISambrone, AShia, SSmith, JSohn, STsui, VUltsch, MWilliams, KWu, LCYang, WZhang, BMagnuson, S Identification of an imidazopyridine scaffold to generate potent and selective TYK2 inhibitors that demonstrate activity in an in vivo psoriasis model. Bioorg Med Chem Lett27:4370-4376 (2017) 
 
Non-receptor tyrosine-protein kinase TYK2
Name:Non-receptor tyrosine-protein kinase TYK2
Type:Protein
Mol. Mass.:133666.03
Organism:Homo sapiens (Human)
Description:P29597
Residue:1187
BDBM50434821
NameBDBM50434821
Synonyms:CHEMBL2387224
TypeSmall organic molecule
Emp. Form.C16H13Cl2N3O2
Mol. Mass.350.199
SMILESClc1cccc(Cl)c1C(=O)Nc1ccnc(NC(=O)C2CC2)c1